Target
Gamma-aminobutyric acid type B receptor subunit 1/2
Ligand
BDBM50007116
Substrate
Meas. Tech.
ChEMBL_68557 (CHEMBL679644)
IC50
124000±n/a nM
Citation
 Berthelot, PVaccher, CFlouquet, NDebaert, MLuyckx, MBrunet, C 3-Thienyl- and 3-furylaminobutyric acids. Synthesis and binding GABAB receptor studies. J Med Chem 34:2557-60 (1991)  
Target
Name:
Gamma-aminobutyric acid type B receptor subunit 1/2
Synonyms:
GABA B receptor | GABA-B receptor 1/2
Type:
Mol. Mass.:
Description:
ASSAY_ID of EBI is 68556
Components:
This complex has 2 components.
Component 1
Name:
Gamma-aminobutyric acid type B receptor subunit 1
Synonyms:
GABA B GABA uptake GABA-B-R1 GABABR1 Gabbr1 | Gb1
Type:
Enzyme Catalytic Domain
Mol. Mass.:
111548.69
Organism:
Rattus norvegicus (Rat)
Description:
Q9Z0U4
Residue:
991
  
Component 2
Name:
Gamma-aminobutyric acid type B receptor subunit 2
Synonyms:
GABA B receptor Gabbr2 | Gpr51
Type:
PROTEIN
Mol. Mass.:
105775.46
Organism:
Rattus norvegicus
Description:
O88871
Residue:
940
  
Inhibitor
Name:
BDBM50007116
Synonyms:
4-Amino-3-(3-methyl-thiophen-2-yl)-butyric acid | CHEMBL313323
Type:
Small organic molecule
Emp. Form.:
C9H13NO2S
Mol. Mass.:
199.27
SMILES:
Cc1ccsc1C(CN)CC(O)=O
: