Target
Gamma-aminobutyric acid type B receptor subunit 1/2
Ligand
BDBM50007120
Substrate
Meas. Tech.
ChEMBL_68557 (CHEMBL679644)
IC50
>100000±n/a nM
Citation
 Berthelot, PVaccher, CFlouquet, NDebaert, MLuyckx, MBrunet, C 3-Thienyl- and 3-furylaminobutyric acids. Synthesis and binding GABAB receptor studies. J Med Chem 34:2557-60 (1991)  
Target
Name:
Gamma-aminobutyric acid type B receptor subunit 1/2
Synonyms:
GABA B receptor | GABA-B receptor 1/2
Type:
Mol. Mass.:
Description:
ASSAY_ID of EBI is 68556
Components:
This complex has 2 components.
Component 1
Name:
Gamma-aminobutyric acid type B receptor subunit 1
Synonyms:
GABA B GABA uptake GABA-B-R1 GABABR1 Gabbr1 | Gb1
Type:
Enzyme Catalytic Domain
Mol. Mass.:
111548.69
Organism:
Rattus norvegicus (Rat)
Description:
Q9Z0U4
Residue:
991
  
Component 2
Name:
Gamma-aminobutyric acid type B receptor subunit 2
Synonyms:
GABA B receptor Gabbr2 | Gpr51
Type:
PROTEIN
Mol. Mass.:
105775.46
Organism:
Rattus norvegicus
Description:
O88871
Residue:
940
  
Inhibitor
Name:
BDBM50007120
Synonyms:
4-Amino-3-(4-hydroxy-phenyl)-butyric acid | CHEMBL315440
Type:
Small organic molecule
Emp. Form.:
C10H13NO3
Mol. Mass.:
195.2151
SMILES:
NCC(CC(O)=O)c1ccc(O)cc1
: