Target
Adenosine receptor A2a/A2b
Ligand
BDBM50009547
Substrate
Meas. Tech.
ChEMBL_30534 (CHEMBL643181)
IC50
603±n/a nM
Citation
 Francis, JEWebb, RLGhai, GRHutchison, AJMoskal, MAdeJesus, RYokoyama, RRovinski, SLContardo, NDotson, R Highly selective adenosine A2 receptor agonists in a series of N-alkylated 2-aminoadenosines. J Med Chem 34:2570-9 (1991)  
Target
Name:
Adenosine receptor A2a/A2b
Synonyms:
Adenosine A2 receptor
Type:
Mol. Mass.:
Description:
ASSAY_ID of ChEMBL is 30560
Components:
This complex has 2 components.
Component 1
Name:
Adenosine receptor A2b
Synonyms:
AA2BR_RAT Adora2b
Type:
PROTEIN
Mol. Mass.:
36378.84
Organism:
Rattus norvegicus
Description:
ChEMBL_32934
Residue:
332
  
Component 2
Name:
Adenosine receptor A2a
Synonyms:
AA2AR_RAT Adenosine A2 receptor Adenosine Receptors A2a (A2a) Adenosine receptors A2a Rat striatal adenosine A2a receptor
Type:
G Protein-Coupled Receptor (GPCR)
Mol. Mass.:
45015.65
Organism:
Rattus norvegicus (rat)
Description:
Rat A2A receptors expressed in CHO cells.
Residue:
410
  
Inhibitor
Name:
BDBM50009547
Synonyms:
2-[6-Amino-2-(2-methyl-2-phenyl-propylamino)-purin-9-yl]-5-hydroxymethyl-tetrahydro-furan-3,4-diol | CHEMBL2374419
Type:
Small organic molecule
Emp. Form.:
C20H26N6O4
Mol. Mass.:
414.4582
SMILES:
CC(C)(CNc1nc(N)c2ncn([C@@H]3O[C@H](CO)[C@@H](O)[C@H]3O)c2n1)c1ccccc1
: