Target
Adenosine receptor A1
Ligand
BDBM50009528
Substrate
Meas. Tech.
ChEBML_28539
IC50
6918±n/a nM
Citation
 Francis, JEWebb, RLGhai, GRHutchison, AJMoskal, MAdeJesus, RYokoyama, RRovinski, SLContardo, NDotson, R Highly selective adenosine A2 receptor agonists in a series of N-alkylated 2-aminoadenosines. J Med Chem 34:2570-9 (1991)  
Target
Name:
Adenosine receptor A1
Synonyms:
AA1R_RAT ADENOSINE A1 high Adenosine A1 receptor (A1) Adenosine receptors A1 | Adora1
Type:
Protein
Mol. Mass.:
36704.13
Organism:
Rattus norvegicus (rat)
Description:
Residue:
326
  
Inhibitor
Name:
BDBM50009528
Synonyms:
CHEMBL2374415 | [2-(4-{2-[6-Amino-9-(3,4-dihydroxy-5-hydroxymethyl-tetrahydro-furan-2-yl)-9H-purin-2-ylamino]-ethyl}-phenyl)-ethyl]-phosphonic acid diethyl ester
Type:
Small organic molecule
Emp. Form.:
C20H26N6O4
Mol. Mass.:
414.4582
SMILES:
Nc1nc(NCCCCc2ccccc2)nc2n(cnc12)[C@@H]1O[C@H](CO)[C@@H](O)[C@H]1O
: