Target
Adenosine receptor A1
Ligand
BDBM50009546
Substrate
Meas. Tech.
ChEBML_28539
IC50
912±n/a nM
Citation
 Francis, JEWebb, RLGhai, GRHutchison, AJMoskal, MAdeJesus, RYokoyama, RRovinski, SLContardo, NDotson, R Highly selective adenosine A2 receptor agonists in a series of N-alkylated 2-aminoadenosines. J Med Chem 34:2570-9 (1991)  
Target
Name:
Adenosine receptor A1
Synonyms:
AA1R_RAT ADENOSINE A1 high Adenosine A1 receptor (A1) Adenosine receptors A1 | Adora1
Type:
Protein
Mol. Mass.:
36704.13
Organism:
Rattus norvegicus (rat)
Description:
Residue:
326
  
Inhibitor
Name:
BDBM50009546
Synonyms:
2-{6-Amino-2-[2-(4-methoxy-phenyl)-ethylamino]-purin-9-yl}-5-hydroxymethyl-tetrahydro-furan-3,4-diol CHEMBL98637
Type:
Small organic molecule
Emp. Form.:
C19H24N6O5
Mol. Mass.:
416.4311
SMILES:
COc1ccc(CCNc2nc(N)c3ncn([C@@H]4O[C@H](CO)[C@@H](O)[C@H]4O)c3n2)cc1
: