Target
S-methyl-5'-thioadenosine phosphorylase
Ligand
BDBM50368298
Substrate
Meas. Tech.
ChEBML_103126
Ki
4000±n/a nM
Citation
 Sufrin, JRSpiess, AJKramer, DLLibby, PRMiller, JTBernacki, RJLee, YHBorchardt, RTPorter, CW Targeting 5'-deoxy-5'-(methylthio)adenosine phosphorylase by 5'-haloalkyl analogues of 5'-deoxy-5'-(methylthio)adenosine. J Med Chem 34:2600-6 (1991)  
Target
Name:
S-methyl-5'-thioadenosine phosphorylase
Synonyms:
MTAP_MOUSE S-methyl-5-thioadenosine phosphorylase
Type:
PROTEIN
Mol. Mass.:
31064.59
Organism:
Mus musculus
Description:
ChEMBL_12784
Residue:
283
  
Inhibitor
Name:
BDBM50368298
Synonyms:
CHEMBL611249
Type:
Small organic molecule
Emp. Form.:
C13H18FN5O3S
Mol. Mass.:
343.377
SMILES:
Nc1ncnc2n(cnc12)C1O[C@H](CSCCCF)[C@@H](O)[C@H]1O
: