Target
Sodium-dependent dopamine transporter
Ligand
BDBM50453099
Substrate
Meas. Tech.
ChEBML_61992
IC50
64±n/a nM
Citation
 Carroll, FIGao, YGRahman, MAAbraham, PParham, KLewin, AHBoja, JWKuhar, MJ Synthesis, ligand binding, QSAR, and CoMFA study of 3 beta-(p-substituted phenyl)tropane-2 beta-carboxylic acid methyl esters. J Med Chem 34:2719-25 (1991)  
Target
Name:
Sodium-dependent dopamine transporter
Synonyms:
DA transporter SC6A3_RAT Sodium-dependent dopamine transporter | Sodium-dependent dopamine transporter (DAT)
Type:
Multi-pass membrane protein
Mol. Mass.:
68749.45
Organism:
Rattus norvegicus (rat)
Description:
P23977
Residue:
619
  
Inhibitor
Name:
BDBM50453099
Synonyms:
CHEMBL2310855
Type:
Small organic molecule
Emp. Form.:
C18H24N2O3
Mol. Mass.:
316.3948
SMILES:
[H][C@@]12CCC([C@H]([C@H](C1)c1ccc(NC(C)=O)cc1)C(=O)OC)N2C
: