Target
Adenosine receptor A1
Ligand
BDBM50009685
Substrate
Meas. Tech.
ChEBML_29468
Ki
69000±n/a nM
Citation
 Thompson, RDSecunda, SDaly, JWOlsson, RA N6,9-disubstituted adenines: potent, selective antagonists at the A1 adenosine receptor. J Med Chem 34:2877-82 (1991)  
Target
Name:
Adenosine receptor A1
Synonyms:
AA1R_RAT ADENOSINE A1 high Adenosine A1 receptor (A1) Adenosine receptors A1 | Adora1
Type:
Protein
Mol. Mass.:
36704.13
Organism:
Rattus norvegicus (rat)
Description:
Residue:
326
  
Inhibitor
Name:
BDBM50009685
Synonyms:
9-METHYL-9H-PURIN-6-AMINE 9-Methyl-9H-purin-6-ylamine | CHEMBL65976
Type:
Small organic molecule
Emp. Form.:
C6H7N5
Mol. Mass.:
149.1533
SMILES:
Cn1cnc2c(N)ncnc12
: