Target
Adenosine receptor A1
Ligand
BDBM50009689
Substrate
Meas. Tech.
ChEBML_29468
Ki
19000±n/a nM
Citation
 Thompson, RDSecunda, SDaly, JWOlsson, RA N6,9-disubstituted adenines: potent, selective antagonists at the A1 adenosine receptor. J Med Chem 34:2877-82 (1991)  
Target
Name:
Adenosine receptor A1
Synonyms:
AA1R_RAT ADENOSINE A1 high Adenosine A1 receptor (A1) Adenosine receptors A1 | Adora1
Type:
Protein
Mol. Mass.:
36704.13
Organism:
Rattus norvegicus (rat)
Description:
Residue:
326
  
Inhibitor
Name:
BDBM50009689
Synonyms:
9-Phenyl-9H-purin-6-ylamine | CHEMBL62756
Type:
Small organic molecule
Emp. Form.:
C11H9N5
Mol. Mass.:
211.2227
SMILES:
Nc1ncnc2n(cnc12)-c1ccccc1
: