Target
Adenosine receptor A1
Ligand
BDBM50009690
Substrate
Meas. Tech.
ChEBML_29468
Ki
2000±n/a nM
Citation
 Thompson, RDSecunda, SDaly, JWOlsson, RA N6,9-disubstituted adenines: potent, selective antagonists at the A1 adenosine receptor. J Med Chem 34:2877-82 (1991)  
Target
Name:
Adenosine receptor A1
Synonyms:
AA1R_RAT ADENOSINE A1 high Adenosine A1 receptor (A1) Adenosine receptors A1 | Adora1
Type:
Protein
Mol. Mass.:
36704.13
Organism:
Rattus norvegicus (rat)
Description:
Residue:
326
  
Inhibitor
Name:
BDBM50009690
Synonyms:
CHEMBL321753 | Cyclohexyl-(9-ethyl-9H-purin-6-yl)-amine
Type:
Small organic molecule
Emp. Form.:
C13H19N5
Mol. Mass.:
245.3235
SMILES:
CCn1cnc2c(NC3CCCCC3)ncnc12
: