Target
Sodium-dependent dopamine transporter
Ligand
BDBM50008035
Substrate
Meas. Tech.
ChEBML_62000
IC50
3180±n/a nM
Citation
 Lewin, AHGao, YGAbraham, PBoja, JWKuhar, MJCarroll, FI 2 beta-substituted analogues of cocaine. Synthesis and inhibition of binding to the cocaine receptor. J Med Chem 35:135-40 (1992)  
Target
Name:
Sodium-dependent dopamine transporter
Synonyms:
DA transporter SC6A3_RAT Sodium-dependent dopamine transporter | Sodium-dependent dopamine transporter (DAT)
Type:
Multi-pass membrane protein
Mol. Mass.:
68749.45
Organism:
Rattus norvegicus (rat)
Description:
P23977
Residue:
619
  
Inhibitor
Name:
BDBM50008035
Synonyms:
Benzoic acid 8-methyl-2-methylcarbamoyl-8-aza-bicyclo[3.2.1]oct-3-yl ester; hydrochloride | CHEMBL554446
Type:
Small organic molecule
Emp. Form.:
C17H22N2O3
Mol. Mass.:
302.3682
SMILES:
CNC(=O)C1C2CC[C@H](C[C@@H]1OC(=O)c1ccccc1)N2C
: