Target
Sodium-dependent dopamine transporter
Ligand
BDBM50008047
Substrate
Meas. Tech.
ChEBML_62000
IC50
72±n/a nM
Citation
 Lewin, AHGao, YGAbraham, PBoja, JWKuhar, MJCarroll, FI 2 beta-substituted analogues of cocaine. Synthesis and inhibition of binding to the cocaine receptor. J Med Chem 35:135-40 (1992)  
Target
Name:
Sodium-dependent dopamine transporter
Synonyms:
DA transporter SC6A3_RAT Sodium-dependent dopamine transporter | Sodium-dependent dopamine transporter (DAT)
Type:
Multi-pass membrane protein
Mol. Mass.:
68749.45
Organism:
Rattus norvegicus (rat)
Description:
P23977
Residue:
619
  
Inhibitor
Name:
BDBM50008047
Synonyms:
3-Benzoyloxy-8-methyl-8-aza-bicyclo[3.2.1]octane-2-carboxylic acid 2-(4-amino-phenyl)-ethyl ester; hydrochloride | CHEMBL541032
Type:
Small organic molecule
Emp. Form.:
C24H28N2O4
Mol. Mass.:
408.4901
SMILES:
CN1[C@@H]2CCC1C([C@H](C2)OC(=O)c1ccccc1)C(=O)OCCc1ccc(N)cc1
: