Target
Sodium-dependent dopamine transporter
Ligand
BDBM50008054
Substrate
Meas. Tech.
ChEBML_62000
IC50
371±n/a nM
Citation
 Lewin, AHGao, YGAbraham, PBoja, JWKuhar, MJCarroll, FI 2 beta-substituted analogues of cocaine. Synthesis and inhibition of binding to the cocaine receptor. J Med Chem 35:135-40 (1992)  
Target
Name:
Sodium-dependent dopamine transporter
Synonyms:
DA transporter SC6A3_RAT Sodium-dependent dopamine transporter | Sodium-dependent dopamine transporter (DAT)
Type:
Multi-pass membrane protein
Mol. Mass.:
68749.45
Organism:
Rattus norvegicus (rat)
Description:
P23977
Residue:
619
  
Inhibitor
Name:
BDBM50008054
Synonyms:
3-Benzoyloxy-8-methyl-8-aza-bicyclo[3.2.1]octane-2-carboxylic acid 3-phenyl-allyl ester; hydrochloride | CHEMBL557834
Type:
Small organic molecule
Emp. Form.:
C25H27NO4
Mol. Mass.:
405.4862
SMILES:
CN1[C@@H]2CCC1C([C@H](C2)OC(=O)c1ccccc1)C(=O)OC\C=C\c1ccccc1
: