Target
Vasopressin V1a receptor
Ligand
BDBM50406623
Substrate
Meas. Tech.
ChEMBL_214388 (CHEMBL821119)
Kd
0.180±n/a nM
Citation
 Barbeau, DGuay, SNeugebauer, WEscher, E Preparation and biological activities of potential vasopressin photoaffinity labels. J Med Chem 35:151-7 (1992)  
Target
Name:
Vasopressin V1a receptor
Synonyms:
Avpr1a VASOPRESSIN V1A Vasopressin V1a receptor | Vasopressin receptor
Type:
Enzyme Catalytic Domain
Mol. Mass.:
47674.81
Organism:
RAT
Description:
VASOPRESSIN V1A AVPR1A RAT::P30560
Residue:
424
  
Inhibitor
Name:
BDBM50406623
Synonyms:
CHEMBL2115369
Type:
Small organic molecule
Emp. Form.:
C58H79N11O12S2
Mol. Mass.:
1186.444
SMILES:
COc1ccc(C[C@@H]2NC(=O)C3(CCCC3)CSSC[C@H](NC(=O)[C@H](CC(N)=O)NC(=O)[C@@H](NC(=O)[C@H](Cc3ccccc3)NC2=O)C(C)C)C(=O)N2CCC[C@H]2C(=O)N[C@@H](CCCCN)C(=O)N[C@@H](Cc2ccc(O)cc2)C(N)=O)cc1
: