Target
Renin
Ligand
BDBM50008126
Substrate
Meas. Tech.
ChEBML_192731
IC50
3±n/a nM
Citation
 Doherty, AMSircar, IKornberg, BEQuin, JWinters, RTKaltenbronn, JSTaylor, MDBatley, BLRapundalo, SRRyan, MJ Design and synthesis of potent, selective, and orally active fluorine-containing renin inhibitors. J Med Chem 35:2-14 (1992)  
Target
Name:
Renin
Synonyms:
Angiotensinogenase RENI_HUMAN
Type:
Enzyme
Mol. Mass.:
45058.99
Organism:
Homo sapiens (Human)
Description:
Residue:
406
  
Inhibitor
Name:
BDBM50008126
Synonyms:
5-Cyclohexyl-2,2-difluoro-3-hydroxy-4-{3-(1H-imidazol-4-yl)-2-[2-(morpholine-4-sulfonylamino)-3-phenyl-propionylamino]-propionylamino}-pentanoic acid (2-morpholin-4-yl-ethyl)-amide; methyl alcohol | CHEMBL28311
Type:
Small organic molecule
Emp. Form.:
C36H54F2N8O8S
Mol. Mass.:
796.925
SMILES:
OC([C@H](CC1CCCCC1)NC(=O)[C@H](Cc1cnc[nH]1)NC(=O)[C@H](Cc1ccccc1)NS(=O)(=O)N1CCOCC1)C(F)(F)C(=O)NCCN1CCOCC1
: