Target
Renin
Ligand
BDBM50008128
Substrate
Meas. Tech.
ChEBML_192731
IC50
2.3±n/a nM
Citation
 Doherty, AMSircar, IKornberg, BEQuin, JWinters, RTKaltenbronn, JSTaylor, MDBatley, BLRapundalo, SRRyan, MJ Design and synthesis of potent, selective, and orally active fluorine-containing renin inhibitors. J Med Chem 35:2-14 (1992)  
Target
Name:
Renin
Synonyms:
Angiotensinogenase RENI_HUMAN
Type:
Enzyme
Mol. Mass.:
45058.99
Organism:
Homo sapiens (Human)
Description:
Residue:
406
  
Inhibitor
Name:
BDBM50008128
Synonyms:
6-(3-Methyl-thioureido)-2-[2-(morpholine-4-sulfonylamino)-3-phenyl-propionylamino]-hexanoic acid [1-cyclohexylmethyl-3,3-difluoro-2-hydroxy-3-(2-morpholin-4-yl-ethylcarbamoyl)-propyl]-amide | CHEMBL287265
Type:
Small organic molecule
Emp. Form.:
C38H62F2N8O8S2
Mol. Mass.:
861.074
SMILES:
CNC(=S)NCCCC[C@H](NC(=O)[C@H](Cc1ccccc1)NS(=O)(=O)N1CCOCC1)C(=O)N[C@@H](CC1CCCCC1)C(O)C(F)(F)C(=O)NCCN1CCOCC1
: