Target
Renin
Ligand
BDBM50008130
Substrate
Meas. Tech.
ChEBML_192731
IC50
0.220000±n/a nM
Citation
 Doherty, AMSircar, IKornberg, BEQuin, JWinters, RTKaltenbronn, JSTaylor, MDBatley, BLRapundalo, SRRyan, MJ Design and synthesis of potent, selective, and orally active fluorine-containing renin inhibitors. J Med Chem 35:2-14 (1992)  
Target
Name:
Renin
Synonyms:
Angiotensinogenase RENI_HUMAN
Type:
Enzyme
Mol. Mass.:
45058.99
Organism:
Homo sapiens (Human)
Description:
Residue:
406
  
Inhibitor
Name:
BDBM50008130
Synonyms:
2-[3-Phenyl-2-(3-pyridin-3-yl-propionylamino)-propionylamino]-pent-4-enoic acid [1-cyclohexylmethyl-3,3-difluoro-2-hydroxy-3-(2-morpholin-4-yl-ethylcarbamoyl)-propyl]-amide | CHEMBL286951
Type:
Small organic molecule
Emp. Form.:
C39H54F2N6O6
Mol. Mass.:
740.8795
SMILES:
OC([C@H](CC1CCCCC1)NC(=O)[C@H](CC=C)NC(=O)[C@H](Cc1ccccc1)NC(=O)CCc1cccnc1)C(F)(F)C(=O)NCCN1CCOCC1
: