Target
Renin
Ligand
BDBM50008141
Substrate
Meas. Tech.
ChEBML_192731
IC50
0.210000±n/a nM
Citation
 Doherty, AMSircar, IKornberg, BEQuin, JWinters, RTKaltenbronn, JSTaylor, MDBatley, BLRapundalo, SRRyan, MJ Design and synthesis of potent, selective, and orally active fluorine-containing renin inhibitors. J Med Chem 35:2-14 (1992)  
Target
Name:
Renin
Synonyms:
Angiotensinogenase RENI_HUMAN
Type:
Enzyme
Mol. Mass.:
45058.99
Organism:
Homo sapiens (Human)
Description:
Residue:
406
  
Inhibitor
Name:
BDBM50008141
Synonyms:
2-[2-(Morpholine-4-sulfonylamino)-3-phenyl-propionylamino]-pent-4-enoic acid [1-cyclohexylmethyl-3,3-difluoro-2-hydroxy-3-(2-pyridin-2-yl-ethylcarbamoyl)-propyl]-amide; methyl alcohol | CHEMBL31910
Type:
Small organic molecule
Emp. Form.:
C36H50F2N6O7S
Mol. Mass.:
748.88
SMILES:
OC([C@H](CC1CCCCC1)NC(=O)[C@H](CC=C)NC(=O)[C@H](Cc1ccccc1)NS(=O)(=O)N1CCOCC1)C(F)(F)C(=O)NCCc1ccccn1
: