Target
Cathepsin D
Ligand
BDBM50006856
Substrate
Meas. Tech.
ChEBML_44987
IC50
3696±n/a nM
Citation
 Doherty, AMSircar, IKornberg, BEQuin, JWinters, RTKaltenbronn, JSTaylor, MDBatley, BLRapundalo, SRRyan, MJ Design and synthesis of potent, selective, and orally active fluorine-containing renin inhibitors. J Med Chem 35:2-14 (1992)  
Target
Name:
Cathepsin D
Synonyms:
CATD_BOVIN | CTSD
Type:
PROTEIN
Mol. Mass.:
42158.92
Organism:
Bos taurus
Description:
ChEMBL_1458606
Residue:
387
  
Inhibitor
Name:
BDBM50006856
Synonyms:
4-{3-(2-Amino-thiazol-4-yl)-2-[2-(morpholine-4-sulfonylamino)-3-phenyl-propionylamino]-propionylamino}-5-cyclohexyl-2,2-difluoro-3-oxo-pentanoic acid (2-morpholin-4-yl-ethyl)-amide CHEMBL405227
Type:
Small organic molecule
Emp. Form.:
C36H52F2N8O8S2
Mol. Mass.:
826.974
SMILES:
Nc1nc(C[C@H](NC(=O)[C@H](Cc2ccccc2)NS(=O)(=O)N2CCOCC2)C(=O)N[C@@H](CC2CCCCC2)C(=O)C(F)(F)C(=O)NCCN2CCOCC2)cs1
: