Target
Renin
Ligand
BDBM50008161
Substrate
Meas. Tech.
ChEBML_192731
IC50
1.9±n/a nM
Citation
 Doherty, AMSircar, IKornberg, BEQuin, JWinters, RTKaltenbronn, JSTaylor, MDBatley, BLRapundalo, SRRyan, MJ Design and synthesis of potent, selective, and orally active fluorine-containing renin inhibitors. J Med Chem 35:2-14 (1992)  
Target
Name:
Renin
Synonyms:
Angiotensinogenase RENI_HUMAN
Type:
Enzyme
Mol. Mass.:
45058.99
Organism:
Homo sapiens (Human)
Description:
Residue:
406
  
Inhibitor
Name:
BDBM50008161
Synonyms:
5-Cyclohexyl-2,2-difluoro-3-hydroxy-4-{2-[2-(morpholine-4-sulfonylamino)-3-phenyl-propionylamino]-pent-4-enoylamino}-pentanoic acid ethyl ester; (CH3)2NCHO | CHEMBL284922
Type:
Small organic molecule
Emp. Form.:
C31H46F2N4O8S
Mol. Mass.:
672.781
SMILES:
CCOC(=O)C(F)(F)C(O)[C@H](CC1CCCCC1)NC(=O)[C@H](CC=C)NC(=O)[C@H](Cc1ccccc1)NS(=O)(=O)N1CCOCC1
: