Target
Renin
Ligand
BDBM50008154
Substrate
Meas. Tech.
ChEBML_192731
IC50
0.570000±n/a nM
Citation
 Doherty, AMSircar, IKornberg, BEQuin, JWinters, RTKaltenbronn, JSTaylor, MDBatley, BLRapundalo, SRRyan, MJ Design and synthesis of potent, selective, and orally active fluorine-containing renin inhibitors. J Med Chem 35:2-14 (1992)  
Target
Name:
Renin
Synonyms:
Angiotensinogenase RENI_HUMAN
Type:
Enzyme
Mol. Mass.:
45058.99
Organism:
Homo sapiens (Human)
Description:
Residue:
406
  
Inhibitor
Name:
BDBM50008154
Synonyms:
2-[3-Phenyl-2-(piperazine-1-sulfonylamino)-propionylamino]-pent-4-enoic acid [1-cyclohexylmethyl-3,3-difluoro-2-hydroxy-3-(2-morpholin-4-yl-ethylcarbamoyl)-propyl]-amide; Hydrate | CHEMBL31420
Type:
Small organic molecule
Emp. Form.:
C35H55F2N7O7S
Mol. Mass.:
755.916
SMILES:
OC([C@H](CC1CCCCC1)NC(=O)[C@H](CC=C)NC(=O)[C@H](Cc1ccccc1)NS(=O)(=O)N1CCNCC1)C(F)(F)C(=O)NCCN1CCOCC1
: