Target
Gastrin/cholecystokinin type B receptor
Ligand
BDBM50453156
Substrate
Meas. Tech.
ChEBML_216728
IC50
2800±n/a nM
Citation
 Makovec, FPeris, WRevel, LGiovanetti, RMennuni, LRovati, LC Structure-antigastrin activity relationships of new (R)-4-benzamido-5-oxopentanoic acid derivatives. J Med Chem 35:28-38 (1992)  
Target
Name:
Gastrin/cholecystokinin type B receptor
Synonyms:
Cckbr Cholecystokinin B receptor GASR_RAT | Gastrin/cholecystokinin type B receptor
Type:
Enzyme Catalytic Domain
Mol. Mass.:
48980.43
Organism:
RAT
Description:
Cholecystokinin A CCKBR RAT::P30553
Residue:
452
  
Inhibitor
Name:
BDBM50453156
Synonyms:
CHEMBL2111825
Type:
Small organic molecule
Emp. Form.:
C24H31ClN2O4
Mol. Mass.:
446.967
SMILES:
OC(=O)CC[C@H](NC(=O)c1cccc(Cl)c1)C(=O)NCCC12CC3CC(CC(C3)C1)C2
: