Target
Gastrin/cholecystokinin type B receptor
Ligand
BDBM50008177
Substrate
Meas. Tech.
ChEBML_216728
IC50
400±n/a nM
Citation
 Makovec, FPeris, WRevel, LGiovanetti, RMennuni, LRovati, LC Structure-antigastrin activity relationships of new (R)-4-benzamido-5-oxopentanoic acid derivatives. J Med Chem 35:28-38 (1992)  
Target
Name:
Gastrin/cholecystokinin type B receptor
Synonyms:
Cckbr Cholecystokinin B receptor GASR_RAT | Gastrin/cholecystokinin type B receptor
Type:
Enzyme Catalytic Domain
Mol. Mass.:
48980.43
Organism:
RAT
Description:
Cholecystokinin A CCKBR RAT::P30553
Residue:
452
  
Inhibitor
Name:
BDBM50008177
Synonyms:
4-(3-Aza-spiro[5.5]undec-3-ylcarbamoyl)-4-(3,4-dichloro-benzoylamino)-butyric acid | CHEMBL340630
Type:
Small organic molecule
Emp. Form.:
C22H29Cl2N3O4
Mol. Mass.:
470.389
SMILES:
OC(=O)CCC(NC(=O)c1ccc(Cl)c(Cl)c1)C(=O)NN1CCC2(CCCCC2)CC1
: