Target
Gastrin/cholecystokinin type B receptor
Ligand
BDBM50008199
Substrate
Meas. Tech.
ChEBML_216728
IC50
50600±n/a nM
Citation
 Makovec, FPeris, WRevel, LGiovanetti, RMennuni, LRovati, LC Structure-antigastrin activity relationships of new (R)-4-benzamido-5-oxopentanoic acid derivatives. J Med Chem 35:28-38 (1992)  
Target
Name:
Gastrin/cholecystokinin type B receptor
Synonyms:
Cckbr Cholecystokinin B receptor GASR_RAT | Gastrin/cholecystokinin type B receptor
Type:
Enzyme Catalytic Domain
Mol. Mass.:
48980.43
Organism:
RAT
Description:
Cholecystokinin A CCKBR RAT::P30553
Residue:
452
  
Inhibitor
Name:
BDBM50008199
Synonyms:
4-Butylcarbamoyl-4-(3-chloro-benzoylamino)-butyric acid | CHEMBL125829
Type:
Small organic molecule
Emp. Form.:
C16H21ClN2O4
Mol. Mass.:
340.802
SMILES:
CCCCNC(=O)C(CCC(O)=O)NC(=O)c1cccc(Cl)c1
: