Target
Gastrin/cholecystokinin type B receptor
Ligand
BDBM50008184
Substrate
Meas. Tech.
ChEBML_48430
IC50
2200±n/a nM
Citation
 Makovec, FPeris, WRevel, LGiovanetti, RMennuni, LRovati, LC Structure-antigastrin activity relationships of new (R)-4-benzamido-5-oxopentanoic acid derivatives. J Med Chem 35:28-38 (1992)  
Target
Name:
Gastrin/cholecystokinin type B receptor
Synonyms:
CCK-2 receptor CCK-BR CCKRB Cholecystokinin receptor GASR_HUMAN | Gastrin/cholecystokinin type B receptor
Type:
G Protein-Coupled Receptor (GPCR)
Mol. Mass.:
48445.79
Organism:
Homo sapiens (Human)
Description:
Stable expression of human CCK-2 receptors in HEK 293 cells.
Residue:
447
  
Inhibitor
Name:
BDBM50008184
Synonyms:
4-(3-Chloro-benzoylamino)-4-(3,3-dimethyl-butylcarbamoyl)-butyric acid | CHEMBL124822
Type:
Small organic molecule
Emp. Form.:
C18H25ClN2O4
Mol. Mass.:
368.855
SMILES:
CC(C)(C)CCNC(=O)C(CCC(O)=O)NC(=O)c1cccc(Cl)c1
: