Target
Gastrin/cholecystokinin type B receptor
Ligand
BDBM50008205
Substrate
Meas. Tech.
ChEBML_216728
IC50
1200±n/a nM
Citation
 Makovec, FPeris, WRevel, LGiovanetti, RMennuni, LRovati, LC Structure-antigastrin activity relationships of new (R)-4-benzamido-5-oxopentanoic acid derivatives. J Med Chem 35:28-38 (1992)  
Target
Name:
Gastrin/cholecystokinin type B receptor
Synonyms:
Cckbr Cholecystokinin B receptor GASR_RAT | Gastrin/cholecystokinin type B receptor
Type:
Enzyme Catalytic Domain
Mol. Mass.:
48980.43
Organism:
RAT
Description:
Cholecystokinin A CCKBR RAT::P30553
Residue:
452
  
Inhibitor
Name:
BDBM50008205
Synonyms:
4-(3,3-Dimethyl-butylcarbamoyl)-4-[(1H-indole-2-carbonyl)-amino]-butyric acid | CHEMBL338134
Type:
Small organic molecule
Emp. Form.:
C20H27N3O4
Mol. Mass.:
373.4461
SMILES:
CC(C)(C)CCNC(=O)C(CCC(O)=O)NC(=O)c1cc2ccccc2[nH]1
: