Target
Cholecystokinin receptor type A
Ligand
BDBM50008165
Substrate
Meas. Tech.
ChEBML_50058
IC50
23000±n/a nM
Citation
 Makovec, FPeris, WRevel, LGiovanetti, RMennuni, LRovati, LC Structure-antigastrin activity relationships of new (R)-4-benzamido-5-oxopentanoic acid derivatives. J Med Chem 35:28-38 (1992)  
Target
Name:
Cholecystokinin receptor type A
Synonyms:
CCKAR_RAT Cholecystokinin peripheral Cholecystokinin receptor type A
Type:
Enzyme Catalytic Domain
Mol. Mass.:
49676.37
Organism:
RAT
Description:
Cholecystokinin central 0 RAT::P30551
Residue:
444
  
Inhibitor
Name:
BDBM50008165
Synonyms:
4-(3-Chloro-benzoylamino)-4-(decahydro-naphthalen-2-ylcarbamoyl)-butyric acid | CHEMBL341143
Type:
Small organic molecule
Emp. Form.:
C22H29ClN2O4
Mol. Mass.:
420.93
SMILES:
OC(=O)CCC(NC(=O)c1cccc(Cl)c1)C(=O)NC1CCC2CCCCC2C1
: