Target
Cholecystokinin receptor type A
Ligand
BDBM50008209
Substrate
Meas. Tech.
ChEBML_50058
IC50
60000±n/a nM
Citation
 Makovec, FPeris, WRevel, LGiovanetti, RMennuni, LRovati, LC Structure-antigastrin activity relationships of new (R)-4-benzamido-5-oxopentanoic acid derivatives. J Med Chem 35:28-38 (1992)  
Target
Name:
Cholecystokinin receptor type A
Synonyms:
CCKAR_RAT Cholecystokinin peripheral Cholecystokinin receptor type A
Type:
Enzyme Catalytic Domain
Mol. Mass.:
49676.37
Organism:
RAT
Description:
Cholecystokinin central 0 RAT::P30551
Residue:
444
  
Inhibitor
Name:
BDBM50008209
Synonyms:
4-(3-Chloro-benzoylamino)-4-cyclooctylcarbamoyl-butyric acid | CHEMBL124459
Type:
Small organic molecule
Emp. Form.:
C20H27ClN2O4
Mol. Mass.:
394.892
SMILES:
OC(=O)CCC(NC(=O)c1cccc(Cl)c1)C(=O)NC1CCCCCCC1
: