Target
Cholecystokinin receptor type A
Ligand
BDBM50008206
Substrate
Meas. Tech.
ChEBML_50058
IC50
13000±n/a nM
Citation
 Makovec, FPeris, WRevel, LGiovanetti, RMennuni, LRovati, LC Structure-antigastrin activity relationships of new (R)-4-benzamido-5-oxopentanoic acid derivatives. J Med Chem 35:28-38 (1992)  
Target
Name:
Cholecystokinin receptor type A
Synonyms:
CCKAR_RAT Cholecystokinin peripheral Cholecystokinin receptor type A
Type:
Enzyme Catalytic Domain
Mol. Mass.:
49676.37
Organism:
RAT
Description:
Cholecystokinin central 0 RAT::P30551
Residue:
444
  
Inhibitor
Name:
BDBM50008206
Synonyms:
4-(3,3-Dimethyl-butylcarbamoyl)-4-[(naphthalene-2-carbonyl)-amino]-butyric acid | CHEMBL122922
Type:
Small organic molecule
Emp. Form.:
C22H28N2O4
Mol. Mass.:
384.4687
SMILES:
CC(C)(C)CCNC(=O)C(CCC(O)=O)NC(=O)c1ccc2ccccc2c1
: