Target
Cholecystokinin receptor type A
Ligand
BDBM50008188
Substrate
Meas. Tech.
ChEBML_50058
IC50
80000±n/a nM
Citation
 Makovec, FPeris, WRevel, LGiovanetti, RMennuni, LRovati, LC Structure-antigastrin activity relationships of new (R)-4-benzamido-5-oxopentanoic acid derivatives. J Med Chem 35:28-38 (1992)  
Target
Name:
Cholecystokinin receptor type A
Synonyms:
CCKAR_RAT Cholecystokinin peripheral Cholecystokinin receptor type A
Type:
Enzyme Catalytic Domain
Mol. Mass.:
49676.37
Organism:
RAT
Description:
Cholecystokinin central 0 RAT::P30551
Residue:
444
  
Inhibitor
Name:
BDBM50008188
Synonyms:
4-(3-Chloro-benzoylamino)-4-hexylcarbamoyl-butyric acid | CHEMBL340755
Type:
Small organic molecule
Emp. Form.:
C18H25ClN2O4
Mol. Mass.:
368.855
SMILES:
CCCCCCNC(=O)C(CCC(O)=O)NC(=O)c1cccc(Cl)c1
: