Target
Cholecystokinin receptor type A
Ligand
BDBM50008181
Substrate
Meas. Tech.
ChEBML_50058
IC50
27900±n/a nM
Citation
 Makovec, FPeris, WRevel, LGiovanetti, RMennuni, LRovati, LC Structure-antigastrin activity relationships of new (R)-4-benzamido-5-oxopentanoic acid derivatives. J Med Chem 35:28-38 (1992)  
Target
Name:
Cholecystokinin receptor type A
Synonyms:
CCKAR_RAT Cholecystokinin peripheral Cholecystokinin receptor type A
Type:
Enzyme Catalytic Domain
Mol. Mass.:
49676.37
Organism:
RAT
Description:
Cholecystokinin central 0 RAT::P30551
Residue:
444
  
Inhibitor
Name:
BDBM50008181
Synonyms:
4-(3-Chloro-benzoylamino)-4-(4,4-dimethyl-pentylcarbamoyl)-butyric acid | CHEMBL125703
Type:
Small organic molecule
Emp. Form.:
C19H27ClN2O4
Mol. Mass.:
382.882
SMILES:
CC(C)(C)CCCNC(=O)C(CCC(O)=O)NC(=O)c1cccc(Cl)c1
: