Target
D(1A) dopamine receptor
Ligand
BDBM50004792
Substrate
Meas. Tech.
ChEBML_60355
Ki
1.2±n/a nM
Citation
 Baindur, NTran, MNiznik, HBGuan, HCSeeman, PNeumeyer, JL (+/-)-3-allyl-7-halo-8-hydroxy-1-phenyl-2,3,4,5-tetrahydro-1H-3-benzazepines as selective high affinity D1 dopamine receptor antagonists: synthesis and structure-activity relationship. J Med Chem 35:67-72 (1992)  
Target
Name:
D(1A) dopamine receptor
Synonyms:
DA D1 receptor DRD1 Dopamine D1 receptor Dopamine D1A
Type:
Enzyme
Mol. Mass.:
49303.43
Organism:
Homo sapiens (Human)
Description:
P21728
Residue:
446
  
Inhibitor
Name:
BDBM50004792
Synonyms:
3-Allyl-8-chloro-5-phenyl-2,3,4,5-tetrahydro-1H-benzo[d]azepin-7-ol; hydrochloride | CHEMBL543704
Type:
Small organic molecule
Emp. Form.:
C19H20ClNO
Mol. Mass.:
313.821
SMILES:
Oc1cc2C(CN(CC=C)CCc2cc1Cl)c1ccccc1
: