Target
Sodium-dependent dopamine transporter
Ligand
BDBM50005578
Substrate
Meas. Tech.
ChEBML_61999
IC50
15±n/a nM
Citation
 Carroll, FIGao, YAbraham, PLewin, AHLew, RPatel, ABoja, JWKuhar, MJ Probes for the cocaine receptor. Potentially irreversible ligands for the dopamine transporter. J Med Chem 35:1813-7 (1992)  
Target
Name:
Sodium-dependent dopamine transporter
Synonyms:
DA transporter SC6A3_RAT Sodium-dependent dopamine transporter | Sodium-dependent dopamine transporter (DAT)
Type:
Multi-pass membrane protein
Mol. Mass.:
68749.45
Organism:
Rattus norvegicus (rat)
Description:
P23977
Residue:
619
  
Inhibitor
Name:
BDBM50005578
Synonyms:
4-azido-3-iodophenethyl 3-(4-chlorophenyl)-8-methyl-(3S,5R)-8-azabicyclo[3.2.1]octane-2-carboxylate | CHEMBL369016
Type:
Small organic molecule
Emp. Form.:
C23H24ClIN4O2
Mol. Mass.:
550.82
SMILES:
CN1[C@@H]2CCC1C([C@H](C2)c1ccc(Cl)cc1)C(=O)OCCc1ccc(N=[N+]=[N-])c(I)c1
: