Target
Sodium-dependent dopamine transporter
Ligand
BDBM50006234
Substrate
Meas. Tech.
ChEBML_61999
IC50
1.7±n/a nM
Citation
 Carroll, FIGao, YAbraham, PLewin, AHLew, RPatel, ABoja, JWKuhar, MJ Probes for the cocaine receptor. Potentially irreversible ligands for the dopamine transporter. J Med Chem 35:1813-7 (1992)  
Target
Name:
Sodium-dependent dopamine transporter
Synonyms:
DA transporter SC6A3_RAT Sodium-dependent dopamine transporter | Sodium-dependent dopamine transporter (DAT)
Type:
Multi-pass membrane protein
Mol. Mass.:
68749.45
Organism:
Rattus norvegicus (rat)
Description:
P23977
Residue:
619
  
Inhibitor
Name:
BDBM50006234
Synonyms:
3-(4-Chloro-phenyl)-8-methyl-8-aza-bicyclo[3.2.1]octane-2-carboxylic acid 2-[4-(2-bromo-acetylamino)-phenyl]-ethyl ester
Type:
Small organic molecule
Emp. Form.:
C25H28BrClN2O3
Mol. Mass.:
519.858
SMILES:
CN1C2CCC1[C@H]([C@H](C2)c1ccc(Cl)cc1)C(=O)OCCc1ccc(NC(=O)CBr)cc1
: