Target
Sodium-dependent dopamine transporter
Ligand
BDBM50006239
Substrate
Meas. Tech.
ChEBML_61999
IC50
1.4±n/a nM
Citation
 Carroll, FIGao, YAbraham, PLewin, AHLew, RPatel, ABoja, JWKuhar, MJ Probes for the cocaine receptor. Potentially irreversible ligands for the dopamine transporter. J Med Chem 35:1813-7 (1992)  
Target
Name:
Sodium-dependent dopamine transporter
Synonyms:
DA transporter SC6A3_RAT Sodium-dependent dopamine transporter | Sodium-dependent dopamine transporter (DAT)
Type:
Multi-pass membrane protein
Mol. Mass.:
68749.45
Organism:
Rattus norvegicus (rat)
Description:
P23977
Residue:
619
  
Inhibitor
Name:
BDBM50006239
Synonyms:
3-(4-Amino-3-iodo-phenyl)-8-methyl-8-aza-bicyclo[3.2.1]octane-2-carboxylic acid methyl ester | methyl (2S,3S)-3-(4-amino-3-iodophenyl)-8-methyl-8-azabicyclo[3.2.1]octane-2-carboxylate
Type:
Small organic molecule
Emp. Form.:
C16H21IN2O2
Mol. Mass.:
400.2546
SMILES:
COC(=O)[C@@H]1C2CCC(C[C@@H]1c1ccc(N)c(I)c1)N2C
: