Target
Cholecystokinin receptor type A
Ligand
BDBM50002482
Substrate
Meas. Tech.
ChEBML_49717
IC50
28±n/a nM
Citation
 Shiosaki, KLin, CWKopecka, HCraig, RABianchi, BRMiller, TRWitte, DGStashko, MNadzan, AM Development of potent and selective CCK-A receptor agonists from Boc-CCK-4: tetrapeptides containing Lys(N epsilon)-amide residues. J Med Chem 35:2007-14 (1992)  
Target
Name:
Cholecystokinin receptor type A
Synonyms:
CCK-A receptor CCK1-R CCKAR_CAVPO Cholecystokinin receptor type A | Cholecystokinin-1 receptor
Type:
Mol. Mass.:
48229.77
Organism:
Cavia porcellus
Description:
Residue:
430
  
Inhibitor
Name:
BDBM50002482
Synonyms:
3-[2-[2-tert-Butoxycarbonylamino-3-(1H-indol-3-yl)-propionylamino]-6-(3-pyridin-3-yl-acryloylamino)-hexanoylamino]-N-(1-carbamoyl-2-phenyl-ethyl)-N-methyl-succinamic acid; hydrate | CHEMBL292071
Type:
Small organic molecule
Emp. Form.:
C44H54N8O9
Mol. Mass.:
838.9478
SMILES:
CN([C@@H](Cc1ccccc1)C(N)=O)C(=O)[C@H](CC(O)=O)NC(=O)[C@H](CCCCNC(=O)C=Cc1cccnc1)NC(=O)[C@H](Cc1c[nH]c2ccccc12)NC(=O)OC(C)(C)C
: