Target
Substance-P receptor
Ligand
BDBM50002551
Substrate
Meas. Tech.
ChEBML_205411
IC50
1000±n/a nM
Citation
 Hagiwara, DMiyake, HMorimoto, HMurai, MFujii, TMatsuo, M Studies on neurokinin antagonists. 1. The design of novel tripeptides possessing the glutaminyl-D-tryptophylphenylalanine sequence as substance P antagonists. J Med Chem 35:2015-25 (1992)  
Target
Name:
Substance-P receptor
Synonyms:
NK1R_CAVPO Neurokinin NK1 TACR1
Type:
Enzyme Catalytic Domain
Mol. Mass.:
46261.42
Organism:
GUINEA PIG
Description:
Neurokinin NK1 TACR1 GUINEA PIG::P30547
Residue:
407
  
Inhibitor
Name:
BDBM50002551
Synonyms:
CHEMBL59768 | benzyl 2-[1-[3-carbamoyl-1-neopentylcarboxamido-(1S)-propylcarboxamido]-3-methyl-(1R)-butylcarboxamido]-3-phenyl-(2S)-propanoate
Type:
Small organic molecule
Emp. Form.:
C32H44N4O7
Mol. Mass.:
596.7144
SMILES:
CC(C)C[C@@H](NC(=O)[C@H](CCC(N)=O)NC(=O)OC(C)(C)C)C(=O)N[C@@H](Cc1ccccc1)C(=O)OCc1ccccc1
: