Target
Substance-P receptor
Ligand
BDBM50002554
Substrate
Meas. Tech.
ChEBML_205411
IC50
>100000±n/a nM
Citation
 Hagiwara, DMiyake, HMorimoto, HMurai, MFujii, TMatsuo, M Studies on neurokinin antagonists. 1. The design of novel tripeptides possessing the glutaminyl-D-tryptophylphenylalanine sequence as substance P antagonists. J Med Chem 35:2015-25 (1992)  
Target
Name:
Substance-P receptor
Synonyms:
NK1R_CAVPO Neurokinin NK1 TACR1
Type:
Enzyme Catalytic Domain
Mol. Mass.:
46261.42
Organism:
GUINEA PIG
Description:
Neurokinin NK1 TACR1 GUINEA PIG::P30547
Residue:
407
  
Inhibitor
Name:
BDBM50002554
Synonyms:
2-[3-carbamoyl-1-[2-oxo-(5S)-dihydro-1H-5-pyrrolylcarboxamido]-(1S)-propylcarboxamido]-3-(1H-3-indolyl)-(2R)-propanoic acid | CHEMBL303330
Type:
Small organic molecule
Emp. Form.:
C21H25N5O6
Mol. Mass.:
443.4531
SMILES:
NC(=O)CC[C@H](NC(=O)[C@@H]1CCC(=O)N1)C(=O)N[C@H](Cc1c[nH]c2ccccc12)C(O)=O
: