Target
Substance-P receptor
Ligand
BDBM50002534
Substrate
Meas. Tech.
ChEBML_205411
IC50
>100000±n/a nM
Citation
 Hagiwara, DMiyake, HMorimoto, HMurai, MFujii, TMatsuo, M Studies on neurokinin antagonists. 1. The design of novel tripeptides possessing the glutaminyl-D-tryptophylphenylalanine sequence as substance P antagonists. J Med Chem 35:2015-25 (1992)  
Target
Name:
Substance-P receptor
Synonyms:
NK1R_CAVPO Neurokinin NK1 TACR1
Type:
Enzyme Catalytic Domain
Mol. Mass.:
46261.42
Organism:
GUINEA PIG
Description:
Neurokinin NK1 TACR1 GUINEA PIG::P30547
Residue:
407
  
Inhibitor
Name:
BDBM50002534
Synonyms:
Benzyloxycarbonyl-D-Trp-Phe-D-Trp-amine | CHEMBL304645
Type:
Small organic molecule
Emp. Form.:
C39H38N6O5
Mol. Mass.:
670.7562
SMILES:
NC(=O)[C@@H](Cc1c[nH]c2ccccc12)NC(=O)[C@H](Cc1ccccc1)NC(=O)[C@@H](Cc1c[nH]c2ccccc12)NC(=O)OCc1ccccc1
: