Target
Substance-P receptor
Ligand
BDBM50002568
Substrate
Meas. Tech.
ChEBML_205411
IC50
110±n/a nM
Citation
 Hagiwara, DMiyake, HMorimoto, HMurai, MFujii, TMatsuo, M Studies on neurokinin antagonists. 1. The design of novel tripeptides possessing the glutaminyl-D-tryptophylphenylalanine sequence as substance P antagonists. J Med Chem 35:2015-25 (1992)  
Target
Name:
Substance-P receptor
Synonyms:
NK1R_CAVPO Neurokinin NK1 TACR1
Type:
Enzyme Catalytic Domain
Mol. Mass.:
46261.42
Organism:
GUINEA PIG
Description:
Neurokinin NK1 TACR1 GUINEA PIG::P30547
Residue:
407
  
Inhibitor
Name:
BDBM50002568
Synonyms:
CHEMBL304472 | benzyl 2-[2-(1-formyl-1H-3-indolyl)-1-[2-hydroxy-1-neopentylcarboxamido-(1S)-ethylcarboxamido]-(1R)-ethylcarboxamido]-3-phenyl-(2S)-propanoate
Type:
Small organic molecule
Emp. Form.:
C36H40N4O8
Mol. Mass.:
656.7248
SMILES:
CC(C)(C)OC(=O)N[C@@H](CO)C(=O)N[C@H](Cc1cn(C=O)c2ccccc12)C(=O)N[C@@H](Cc1ccccc1)C(=O)OCc1ccccc1
: