Target
Substance-P receptor
Ligand
BDBM50002538
Substrate
Meas. Tech.
ChEBML_205411
IC50
>100000±n/a nM
Citation
 Hagiwara, DMiyake, HMorimoto, HMurai, MFujii, TMatsuo, M Studies on neurokinin antagonists. 1. The design of novel tripeptides possessing the glutaminyl-D-tryptophylphenylalanine sequence as substance P antagonists. J Med Chem 35:2015-25 (1992)  
Target
Name:
Substance-P receptor
Synonyms:
NK1R_CAVPO Neurokinin NK1 TACR1
Type:
Enzyme Catalytic Domain
Mol. Mass.:
46261.42
Organism:
GUINEA PIG
Description:
Neurokinin NK1 TACR1 GUINEA PIG::P30547
Residue:
407
  
Inhibitor
Name:
BDBM50002538
Synonyms:
CHEMBL294065 | tert-butyloxycarbonyl-Gln-D-Trp(CHO)-Phe-OH
Type:
Small organic molecule
Emp. Form.:
C31H37N5O8
Mol. Mass.:
607.6542
SMILES:
CC(C)(C)OC(=O)N[C@@H](CCC(N)=O)C(=O)N[C@H](Cc1cn(C=O)c2ccccc12)C(=O)N[C@@H](Cc1ccccc1)C(O)=O
: