Target
Substance-P receptor
Ligand
BDBM50002541
Substrate
Meas. Tech.
ChEBML_205411
IC50
100000±n/a nM
Citation
 Hagiwara, DMiyake, HMorimoto, HMurai, MFujii, TMatsuo, M Studies on neurokinin antagonists. 1. The design of novel tripeptides possessing the glutaminyl-D-tryptophylphenylalanine sequence as substance P antagonists. J Med Chem 35:2015-25 (1992)  
Target
Name:
Substance-P receptor
Synonyms:
NK1R_CAVPO Neurokinin NK1 TACR1
Type:
Enzyme Catalytic Domain
Mol. Mass.:
46261.42
Organism:
GUINEA PIG
Description:
Neurokinin NK1 TACR1 GUINEA PIG::P30547
Residue:
407
  
Inhibitor
Name:
BDBM50002541
Synonyms:
CHEMBL64829 | tert-butyl 5-[1-[1-benzyloxycarbonyl-3-carbamoyl-(1S)-propylcarbamoyl]-3-carbamoyl-(1S)-propylcarbamoyl]-(5R)-dihydro-1H-1-pyrrolecarboxylate
Type:
Small organic molecule
Emp. Form.:
C27H39N5O8
Mol. Mass.:
561.6273
SMILES:
CC(C)(C)OC(=O)N1CCC[C@@H]1C(=O)N[C@@H](CCC(N)=O)C(=O)N[C@@H](CCC(N)=O)C(=O)OCc1ccccc1
: