Target
Substance-P receptor
Ligand
BDBM50002564
Substrate
Meas. Tech.
ChEBML_205411
IC50
400±n/a nM
Citation
 Hagiwara, DMiyake, HMorimoto, HMurai, MFujii, TMatsuo, M Studies on neurokinin antagonists. 1. The design of novel tripeptides possessing the glutaminyl-D-tryptophylphenylalanine sequence as substance P antagonists. J Med Chem 35:2015-25 (1992)  
Target
Name:
Substance-P receptor
Synonyms:
NK1R_CAVPO Neurokinin NK1 TACR1
Type:
Enzyme Catalytic Domain
Mol. Mass.:
46261.42
Organism:
GUINEA PIG
Description:
Neurokinin NK1 TACR1 GUINEA PIG::P30547
Residue:
407
  
Inhibitor
Name:
BDBM50002564
Synonyms:
Benzyloxycarbonyl-Gln-D-Trp(CHO)-Phe(methoxy-cyclohexane) | CHEMBL62711
Type:
Small organic molecule
Emp. Form.:
C38H49N5O8
Mol. Mass.:
703.8244
SMILES:
CC(C)(C)OC(=O)N[C@@H](CCC(N)=O)C(=O)N[C@H](Cc1cn(C=O)c2ccccc12)C(=O)N[C@@H](Cc1ccccc1)C(=O)OCC1CCCCC1
: