Target
Integrin alpha-IIb/beta-3
Ligand
BDBM50006295
Substrate
Meas. Tech.
ChEMBL_89731 (CHEMBL696585)
IC50
>500000±n/a nM
Citation
 Barker, PLBullens, SBunting, SBurdick, DJChan, KSDeisher, TEigenbrot, CGadek, TRGantzos, RLipari, MT Cyclic RGD peptide analogues as antiplatelet antithrombotics. J Med Chem 35:2040-8 (1992)  
Target
Name:
Integrin alpha-IIb/beta-3
Synonyms:
Glycoprotein IIb/IIIa
Type:
Mol. Mass.:
Description:
ASSAY_ID of EBI is 30109
Components:
This complex has 2 components.
Component 1
Name:
Integrin beta-3
Synonyms:
CD_antigen=CD61 GPIIIa ITGB3 Platelet membrane glycoprotein IIIa
Type:
Protein
Mol. Mass.:
87038.91
Organism:
Homo sapiens (Human)
Description:
P05106
Residue:
788
  
Component 2
Name:
Integrin alpha-IIb
Synonyms:
CD_antigen=CD41 GPIIb Glycoprotein IIb ITGA2B Integrin alpha-IIb heavy chain Integrin alpha-IIb light chain, form 2 Integrin alpha-V/beta-3 and alpha-IIb/beta 3 | Platelet membrane glycoprotein IIb
Type:
Protein
Mol. Mass.:
113354.85
Organism:
Homo sapiens (Human)
Description:
P08514
Residue:
1039
  
Inhibitor
Name:
BDBM50006295
Synonyms:
3-{2-[2-(2-Acetylamino-acetylamino)-5-guanidino-pentanoylamino]-acetylamino}-N-(1-carbamoyl-2-methyl-propyl)-succinamic acid | CHEMBL62394
Type:
Small organic molecule
Emp. Form.:
C21H37N9O8
Mol. Mass.:
543.574
SMILES:
CC(C)[C@H](NC(=O)[C@H](CC(O)=O)NC(=O)CNC(=O)[C@H](CCCNC(N)=N)NC(=O)CNC(C)=O)C(N)=O
: