Target
Integrin alpha-IIb/beta-3
Ligand
BDBM50006274
Substrate
Meas. Tech.
ChEMBL_89731 (CHEMBL696585)
IC50
4000±n/a nM
Citation
 Barker, PLBullens, SBunting, SBurdick, DJChan, KSDeisher, TEigenbrot, CGadek, TRGantzos, RLipari, MT Cyclic RGD peptide analogues as antiplatelet antithrombotics. J Med Chem 35:2040-8 (1992)  
Target
Name:
Integrin alpha-IIb/beta-3
Synonyms:
Glycoprotein IIb/IIIa
Type:
Mol. Mass.:
Description:
ASSAY_ID of EBI is 30109
Components:
This complex has 2 components.
Component 1
Name:
Integrin beta-3
Synonyms:
CD_antigen=CD61 GPIIIa ITGB3 Platelet membrane glycoprotein IIIa
Type:
Protein
Mol. Mass.:
87038.91
Organism:
Homo sapiens (Human)
Description:
P05106
Residue:
788
  
Component 2
Name:
Integrin alpha-IIb
Synonyms:
CD_antigen=CD41 GPIIb Glycoprotein IIb ITGA2B Integrin alpha-IIb heavy chain Integrin alpha-IIb light chain, form 2 Integrin alpha-V/beta-3 and alpha-IIb/beta 3 | Platelet membrane glycoprotein IIb
Type:
Protein
Mol. Mass.:
113354.85
Organism:
Homo sapiens (Human)
Description:
P08514
Residue:
1039
  
Inhibitor
Name:
BDBM50006274
Synonyms:
6-Carboxymethyl-12-(3-guanidino-propyl)-18-naphthalen-2-yl-5,8,11,14,17-pentaoxo-1-thia-4,7,10,13,16-pentaaza-cyclooctadecane-3-carboxylic acid | CHEMBL66530
Type:
Small organic molecule
Emp. Form.:
C29H36N8O9S
Mol. Mass.:
672.709
SMILES:
NC(=N)NCCC[C@@H]1NC(=O)CNC(=O)C(SC[C@H](NC(=O)[C@H](CC(O)=O)NC(=O)CNC1=O)C(O)=O)c1ccc2ccccc2c1
: