Target
Integrin alpha-IIb/beta-3
Ligand
BDBM50368318
Substrate
Meas. Tech.
ChEMBL_89731 (CHEMBL696585)
IC50
60±n/a nM
Citation
 Barker, PLBullens, SBunting, SBurdick, DJChan, KSDeisher, TEigenbrot, CGadek, TRGantzos, RLipari, MT Cyclic RGD peptide analogues as antiplatelet antithrombotics. J Med Chem 35:2040-8 (1992)  
Target
Name:
Integrin alpha-IIb/beta-3
Synonyms:
Glycoprotein IIb/IIIa
Type:
Mol. Mass.:
Description:
ASSAY_ID of EBI is 30109
Components:
This complex has 2 components.
Component 1
Name:
Integrin beta-3
Synonyms:
CD_antigen=CD61 GPIIIa ITGB3 Platelet membrane glycoprotein IIIa
Type:
Protein
Mol. Mass.:
87038.91
Organism:
Homo sapiens (Human)
Description:
P05106
Residue:
788
  
Component 2
Name:
Integrin alpha-IIb
Synonyms:
CD_antigen=CD41 GPIIb Glycoprotein IIb ITGA2B Integrin alpha-IIb heavy chain Integrin alpha-IIb light chain, form 2 Integrin alpha-V/beta-3 and alpha-IIb/beta 3 | Platelet membrane glycoprotein IIb
Type:
Protein
Mol. Mass.:
113354.85
Organism:
Homo sapiens (Human)
Description:
P08514
Residue:
1039
  
Inhibitor
Name:
BDBM50368318
Synonyms:
CHEMBL1790445
Type:
Small organic molecule
Emp. Form.:
C27H40N8O9S
Mol. Mass.:
652.72
SMILES:
[#6]-[#6@@H](-[#8])-[#6@@H]-1-[#7]-c2cccc(-[#6]-[#6]-[#16]-[#6]-[#6@H](-[#7]-[#6](=O)-[#6@H](-[#6]-[#6](-[#8])=O)-[#7]-[#6](=O)-[#6]-[#7]-[#6](=O)-[#6@H](-[#6]-[#6]-[#6]\[#7]=[#6](\[#7])-[#7])-[#7]-[#6]-1=O)-[#6](-[#8])=O)c2
: