Target
Histamine H1 receptor
Ligand
BDBM50002099
Substrate
Meas. Tech.
ChEBML_83429
Ki
0.130000±n/a nM
Citation
 Ohshima, EOtaki, SSato, HKumazawa, TObase, HIshii, AIshii, HOhmori, KHirayama, N Synthesis and antiallergic activity of 11-(aminoalkylidene)-6,11-dihydrodibenz[b,e]oxepin derivatives. J Med Chem 35:2074-84 (1992)  
Target
Name:
Histamine H1 receptor
Synonyms:
HISTAMINE H1 HRH1_CAVPO
Type:
G Protein-Coupled Receptor (GPCR)
Mol. Mass.:
55641.53
Organism:
Cavia porcellus (domestic guinea pig)
Description:
Guinea pig cerebellum was used in binding assay.
Residue:
488
  
Inhibitor
Name:
BDBM50002099
Synonyms:
CHEMBL366965 | Dimethyl-[3-(2-methyl-6H-dibenzo[b,e]oxepin-11-ylidene)-propyl]-amine; compound with but-2-enedioic acid
Type:
Small organic molecule
Emp. Form.:
C20H23NO
Mol. Mass.:
293.4027
SMILES:
CN(C)CC\C=C1/c2ccccc2COc2ccc(C)cc12
: