Target
3-hydroxy-3-methylglutaryl-coenzyme A reductase
Ligand
BDBM50006411
Substrate
Meas. Tech.
ChEBML_80349
IC50
17±n/a nM
Citation
 Sliskovic, DRBlankley, CJKrause, BRNewton, RSPicard, JARoark, WHRoth, BDSekerke, CShaw, MKStanfield, RL Inhibitors of cholesterol biosynthesis. 6. trans-6-[2-(2-N-heteroaryl-3,5-disubstituted- pyrazol-4-yl)ethyl/ethenyl]tetrahydro-4-hydroxy-2H-pyran-2-ones. J Med Chem 35:2095-103 (1992)  
Target
Name:
3-hydroxy-3-methylglutaryl-coenzyme A reductase
Synonyms:
3-hydroxy-3-methylglutaryl-coenzyme A (HMG-CoA) reductase HMDH_HUMAN HMG-CoA reductase (HMGR) | HMGCR
Type:
Enzyme
Mol. Mass.:
97477.10
Organism:
Homo sapiens (Human)
Description:
P04035
Residue:
888
  
Inhibitor
Name:
BDBM50006411
Synonyms:
CHEMBL2367470 | Sodium; 7-[5-(4-fluoro-phenyl)-1-pyridin-2-yl-3-trifluoromethyl-1H-pyrazol-4-yl]-3,5-dihydroxy-hept-6-enoate
Type:
Small organic molecule
Emp. Form.:
C22H18F4N3NaO4
Mol. Mass.:
487.3794
SMILES:
[Na+].O[C@H](C[C@H](O)\C=C\c1c(nn(c1-c1ccc(F)cc1)-c1ccccn1)C(F)(F)F)CC([O-])=O
: