Target
3-hydroxy-3-methylglutaryl-coenzyme A reductase
Ligand
BDBM34168
Substrate
Meas. Tech.
ChEBML_80349
IC50
20±n/a nM
Citation
 Sliskovic, DRBlankley, CJKrause, BRNewton, RSPicard, JARoark, WHRoth, BDSekerke, CShaw, MKStanfield, RL Inhibitors of cholesterol biosynthesis. 6. trans-6-[2-(2-N-heteroaryl-3,5-disubstituted- pyrazol-4-yl)ethyl/ethenyl]tetrahydro-4-hydroxy-2H-pyran-2-ones. J Med Chem 35:2095-103 (1992)  
Target
Name:
3-hydroxy-3-methylglutaryl-coenzyme A reductase
Synonyms:
3-hydroxy-3-methylglutaryl-coenzyme A (HMG-CoA) reductase HMDH_HUMAN HMG-CoA reductase (HMGR) | HMGCR
Type:
Enzyme
Mol. Mass.:
97477.10
Organism:
Homo sapiens (Human)
Description:
P04035
Residue:
888
  
Inhibitor
Name:
BDBM34168
Synonyms:
LOVASTATIN SMR000058779 US9353061, Lovastatina | cid_53232
Type:
Small organic molecule
Emp. Form.:
C24H36O5
Mol. Mass.:
404.5396
SMILES:
CC[C@H](C)C(=O)O[C@H]1C[C@@H](C)C=C2C=C[C@H](C)[C@H](CC[C@@H]3C[C@@H](O)CC(=O)O3)[C@@H]12
: