Target
Adenosine receptor A1
Ligand
BDBM50453216
Substrate
Meas. Tech.
ChEBML_28837
Ki
133±n/a nM
Citation
 Abiru, TMiyashita, TWatanabe, YYamaguchi, TMachida, HMatsuda, A Nucleosides and nucleotides. 107. 2-(cycloalkylalkynyl)adenosines: adenosine A2 receptor agonists with potent antihypertensive effects. J Med Chem 35:2253-60 (1992)  
Target
Name:
Adenosine receptor A1
Synonyms:
AA1R_RAT ADENOSINE A1 high Adenosine A1 receptor (A1) Adenosine receptors A1 | Adora1
Type:
Protein
Mol. Mass.:
36704.13
Organism:
Rattus norvegicus (rat)
Description:
Residue:
326
  
Inhibitor
Name:
BDBM50453216
Synonyms:
2-(l-hexyn-l-yl)adenosine (8, YT-146) | CHEMBL2113496
Type:
Small organic molecule
Emp. Form.:
C18H25N5O4
Mol. Mass.:
375.4222
SMILES:
CCCCCCC#Cc1nc(N)c2ncn([C@@H]3O[C@H](CO)[C@@H](O)[C@H]3O)c2n1
: